Reaction Details
TargetcGMP-inhibited 3',5'-cyclic phosphodiesterase 3B
LigandBDBM14754
Substrate/Competitorn/a
Meas. Tech.ChEMBL_765732 (CHEMBL1827311)
IC50 1030±n/a nM
Citation Zhang, ZLu, XXu, JRothfuss, JMach, RHTu, Z Synthesis and in vitro evaluation of new analogues as inhibitors for phosphodiesterase 10A. Eur J Med Chem46:3986-95 (2011) 
 
cGMP-inhibited 3',5'-cyclic phosphodiesterase 3B
Name:cGMP-inhibited 3',5'-cyclic phosphodiesterase 3B
Type:Enzyme
Mol. Mass.:124318.95
Organism:Homo sapiens (Human)
Description:PDE3B was generated from the full-length recombinant human clone transfected into Sf9 cells.
Residue:1112
BDBM14754
NameBDBM14754
Synonyms:1-[(3,4-dimethoxyphenyl)methyl]-6,7-dimethoxy-isoquinoline 6,7-dimethoxy-1-veratryl-isoquinoline;hydrochloride Papaverine
TypeSmall organic molecule
Emp. Form.C20H21NO4
Mol. Mass.339.385
SMILESCOc1ccc(Cc2nccc3cc(OC)c(OC)cc23)cc1OC