Reaction Details
TargetHistone deacetylase 1
LigandBDBM50351945
Substrate/Competitorn/a
Meas. Tech.ChEMBL_766013 (CHEMBL1828142)
IC50 32.27±n/a nM
Citation Huang, WJChen, CCChao, SWYu, CCYang, CYGuh, JHLin, YCKuo, CIYang, PChang, CI Synthesis and evaluation of aliphatic-chain hydroxamates capped with osthole derivatives as histone deacetylase inhibitors. Eur J Med Chem46:4042-9 (2011) 
 
Histone deacetylase 1
Name:Histone deacetylase 1
Type:Enzyme
Mol. Mass.:55090.27
Organism:Homo sapiens (Human)
Description:Q13547
Residue:482
BDBM50351945
NameBDBM50351945
Synonyms:CHEMBL1822046
TypeSmall organic molecule
Emp. Form.C21H29NO5
Mol. Mass.375.4587
SMILESCC(C)CCc1c(OCCCCCCC(=O)NO)ccc2ccc(=O)oc12