Reaction Details
TargetPhosphatidylinositol 4,5-bisphosphate 3-kinase catalytic subunit alpha isoform
LigandBDBM50351951
Substrate/Competitorn/a
Meas. Tech.ChEMBL_766021 (CHEMBL1828259)
Ki 6.1±n/a nM
Citation Stec, MMAndrews, KLBooker, SKCaenepeel, SFreeman, DJJiang, JLiao, HMcCarter, JMullady, ELSan Miguel, TSubramanian, RTamayo, NWang, LYang, KZalameda, LPZhang, NHughes, PENorman, MH Structure-activity relationships of phosphoinositide 3-kinase (PI3K)/mammalian target of rapamycin (mTOR) dual inhibitors: investigations of various 6,5-heterocycles to improve metabolic stability. J Med Chem54:5174-84 (2011) 
 
Phosphatidylinositol 4,5-bisphosphate 3-kinase catalytic subunit alpha isoform
Name:Phosphatidylinositol 4,5-bisphosphate 3-kinase catalytic subunit alpha isoform
Type:Enzyme Subunit
Mol. Mass.:124294.87
Organism:Homo sapiens (Human)
Description:P42336
Residue:1068
BDBM50351951
NameBDBM50351951
Synonyms:CHEMBL1822056
TypeSmall organic molecule
Emp. Form.C17H11ClFN5O2S
Mol. Mass.403.818
SMILESFc1ccc(cc1)S(=O)(=O)Nc1cc(cnc1Cl)-c1ccc2nccn2n1