Reaction Details
TargetVesicular acetylcholine transporter
LigandBDBM50046952
Substrate/Competitorn/a
Meas. Tech.ChEMBL_765941 (CHEMBL1827957)
Ki 0.220000±n/a nM
Citation Wang, WCui, JLu, XPadakanti, PKXu, JParsons, SMLuedtke, RRRath, NPTu, Z Synthesis and in vitro biological evaluation of carbonyl group-containing analogues fors1 receptors. J Med Chem54:5362-72 (2011) 
 
Vesicular acetylcholine transporter
Name:Vesicular acetylcholine transporter
Type:PROTEIN
Mol. Mass.:56900.67
Organism:Homo sapiens (Human)
Description:ChEMBL_1507628
Residue:532
BDBM50046952
NameBDBM50046952
Synonyms:(3'R,4'R)-1'-(4-Fluoro-benzyl)-4-phenyl-[1,3']bipiperidinyl-4'-ol CHEMBL1956464 trans-1-(4-fluorobenzyl)-3-(4-phenylpiperidin-1-yl)piperidin-4-ol
TypeSmall organic molecule
Emp. Form.C23H29FN2O
Mol. Mass.368.4876
SMILESO[C@@H]1CCN(Cc2ccc(F)cc2)C[C@H]1N1CCC(CC1)c1ccccc1