Reaction Details
Target3-dehydroquinate dehydratase
LigandBDBM50352028
Substrate/Competitorn/a
Meas. Tech.ChEMBL_766423 (CHEMBL1826563)
Ki 250±n/a nM
Citation Tizón, LOtero, JMPrazeres, VFLlamas-Saiz, ALFox, GCvan Raaij, MJLamb, HHawkins, ARAinsa, JACastedo, LGonzález-Bello, C A prodrug approach for improving antituberculosis activity of potent Mycobacterium tuberculosis type II dehydroquinase inhibitors. J Med Chem54:6063-84 (2011) 
 
3-dehydroquinate dehydratase
Name:3-dehydroquinate dehydratase
Type:PROTEIN
Mol. Mass.:15786.25
Organism:Mycobacterium tuberculosis
Description:ChEMBL_766423
Residue:147
BDBM50352028
NameBDBM50352028
Synonyms:CHEMBL1823557
TypeSmall organic molecule
Emp. Form.C11H12O5S
Mol. Mass.256.275
SMILESO[C@@H]1C[C@@](O)(C=C([C@H]1O)c1cccs1)C(O)=O