Reaction Details
Target3-dehydroquinate dehydratase
LigandBDBM50303444
Substrate/Competitorn/a
Meas. Tech.ChEMBL_766423 (CHEMBL1826563)
Ki 42.5±n/a nM
Citation Tizón, LOtero, JMPrazeres, VFLlamas-Saiz, ALFox, GCvan Raaij, MJLamb, HHawkins, ARAinsa, JACastedo, LGonzález-Bello, C A prodrug approach for improving antituberculosis activity of potent Mycobacterium tuberculosis type II dehydroquinase inhibitors. J Med Chem54:6063-84 (2011) 
 
3-dehydroquinate dehydratase
Name:3-dehydroquinate dehydratase
Type:PROTEIN
Mol. Mass.:15786.25
Organism:Mycobacterium tuberculosis
Description:ChEMBL_766423
Residue:147
BDBM50303444
NameBDBM50303444
Synonyms:CHEMBL567564 | Sodium(1R,4S,5R)-1,4,5-Trihydroxy-3-(5-methylbenzo[b]-thiophen-2-yl)methoxycyclohexan-1-carboxylate
TypeSmall organic molecule
Emp. Form.C17H17O6S
Mol. Mass.349.379
SMILESCc1ccc2sc(COC3=C[C@](O)(C[C@@H](O)[C@@H]3O)C([O-])=O)cc2c1