Reaction Details
Target3-dehydroquinate dehydratase
LigandBDBM50303446
Substrate/Competitorn/a
Meas. Tech.ChEMBL_766423 (CHEMBL1826563)
Ki 31±n/a nM
Citation Tizón, LOtero, JMPrazeres, VFLlamas-Saiz, ALFox, GCvan Raaij, MJLamb, HHawkins, ARAinsa, JACastedo, LGonzález-Bello, C A prodrug approach for improving antituberculosis activity of potent Mycobacterium tuberculosis type II dehydroquinase inhibitors. J Med Chem54:6063-84 (2011) 
 
3-dehydroquinate dehydratase
Name:3-dehydroquinate dehydratase
Type:PROTEIN
Mol. Mass.:15786.25
Organism:Mycobacterium tuberculosis
Description:ChEMBL_766423
Residue:147
BDBM50303446
NameBDBM50303446
Synonyms:CHEMBL576247 | Sodium(1R,4S,5R)-1,4,5-Trihydroxy-3-[(benzo[b]tiophen-5-yl)methoxy]cyclohex-2-en-1-carboxylate
TypeSmall organic molecule
Emp. Form.C16H15O6S
Mol. Mass.335.352
SMILESO[C@@H]1C[C@@](O)(C=C(OCc2ccc3sccc3c2)[C@H]1O)C([O-])=O