Reaction Details
Target3-dehydroquinate dehydratase
LigandBDBM50352032
Substrate/Competitorn/a
Meas. Tech.ChEMBL_766423 (CHEMBL1826563)
Ki 35±n/a nM
Citation Tizón, LOtero, JMPrazeres, VFLlamas-Saiz, ALFox, GCvan Raaij, MJLamb, HHawkins, ARAinsa, JACastedo, LGonzález-Bello, C A prodrug approach for improving antituberculosis activity of potent Mycobacterium tuberculosis type II dehydroquinase inhibitors. J Med Chem54:6063-84 (2011) 
 
3-dehydroquinate dehydratase
Name:3-dehydroquinate dehydratase
Type:PROTEIN
Mol. Mass.:15786.25
Organism:Mycobacterium tuberculosis
Description:ChEMBL_766423
Residue:147
BDBM50352032
NameBDBM50352032
Synonyms:CHEMBL1823561
TypeSmall organic molecule
Emp. Form.C18H17O6
Mol. Mass.329.3245
SMILESO[C@@H]1C[C@@](O)(C=C(OCc2ccc3ccccc3c2)[C@H]1O)C([O-])=O