Reaction Details
Target3-dehydroquinate dehydratase
LigandBDBM50352034
Substrate/Competitorn/a
Meas. Tech.ChEMBL_766423 (CHEMBL1826563)
Ki 1100±n/a nM
Citation Tizón, LOtero, JMPrazeres, VFLlamas-Saiz, ALFox, GCvan Raaij, MJLamb, HHawkins, ARAinsa, JACastedo, LGonzález-Bello, C A prodrug approach for improving antituberculosis activity of potent Mycobacterium tuberculosis type II dehydroquinase inhibitors. J Med Chem54:6063-84 (2011) 
 
3-dehydroquinate dehydratase
Name:3-dehydroquinate dehydratase
Type:PROTEIN
Mol. Mass.:15786.25
Organism:Mycobacterium tuberculosis
Description:ChEMBL_766423
Residue:147
BDBM50352034
NameBDBM50352034
Synonyms:CHEMBL1823564
TypeSmall organic molecule
Emp. Form.C25H19Cl2O6S2
Mol. Mass.550.451
SMILESO[C@@H]1C[C@](O)(C([O-])=O)C(Cc2cc3ccc(Cl)cc3s2)=C(OCc2cc3ccc(Cl)cc3s2)[C@H]1O