Reaction Details
Target3-dehydroquinate dehydratase
LigandBDBM50352027
Substrate/Competitorn/a
Meas. Tech.ChEMBL_766423 (CHEMBL1826563)
Ki 59±n/a nM
Citation Tizón, LOtero, JMPrazeres, VFLlamas-Saiz, ALFox, GCvan Raaij, MJLamb, HHawkins, ARAinsa, JACastedo, LGonzález-Bello, C A prodrug approach for improving antituberculosis activity of potent Mycobacterium tuberculosis type II dehydroquinase inhibitors. J Med Chem54:6063-84 (2011) 
 
3-dehydroquinate dehydratase
Name:3-dehydroquinate dehydratase
Type:PROTEIN
Mol. Mass.:15786.25
Organism:Mycobacterium tuberculosis
Description:ChEMBL_766423
Residue:147
BDBM50352027
NameBDBM50352027
Synonyms:CHEMBL1823571
TypeSmall organic molecule
Emp. Form.C21H19O6S2
Mol. Mass.431.503
SMILESO[C@@H]1C[C@](O)(C([O-])=O)C(Cc2ccc3sccc3c2)=C(OCc2cccs2)[C@H]1O