Reaction Details
TargetSphingosine 1-phosphate receptor 4
LigandBDBM62407
Substrate/Competitorn/a
Meas. Tech.ChEMBL_766636 (CHEMBL1827202)
IC50 78±n/a nM
Citation Urbano, MGuerrero, MZhao, JVelaparthi, SSchaeffer, MTBrown, SRosen, HRoberts, E SAR analysis of innovative selective small molecule antagonists of sphingosine-1-phosphate 4 (S1P4) receptor. Bioorg Med Chem Lett21:5470-4 (2011) 
 
Sphingosine 1-phosphate receptor 4
Name:Sphingosine 1-phosphate receptor 4
Type:G Protein-Coupled Receptor (GPCR)
Mol. Mass.:41647.39
Organism:Homo sapiens (Human)
Description:n/a
Residue:384
BDBM62407
NameBDBM62407
Synonyms:5-(2,5-dichlorophenyl)-N-(2,6-dimethylphenyl)-2-furamide 5-(2,5-dichlorophenyl)-N-(2,6-dimethylphenyl)furan-2-carboxamide SR-02000000251 cid_4492589
TypeSmall organic molecule
Emp. Form.C19H15Cl2NO2
Mol. Mass.360.234
SMILESCc1cccc(C)c1NC(=O)c1ccc(o1)-c1cc(Cl)ccc1Cl