Reaction Details
TargetSphingosine 1-phosphate receptor 4
LigandBDBM50352108
Substrate/Competitorn/a
Meas. Tech.ChEMBL_766636 (CHEMBL1827202)
IC50 75±n/a nM
Citation Urbano, MGuerrero, MZhao, JVelaparthi, SSchaeffer, MTBrown, SRosen, HRoberts, E SAR analysis of innovative selective small molecule antagonists of sphingosine-1-phosphate 4 (S1P4) receptor. Bioorg Med Chem Lett21:5470-4 (2011) 
 
Sphingosine 1-phosphate receptor 4
Name:Sphingosine 1-phosphate receptor 4
Type:G Protein-Coupled Receptor (GPCR)
Mol. Mass.:41647.39
Organism:Homo sapiens (Human)
Description:n/a
Residue:384
BDBM50352108
NameBDBM50352108
Synonyms:CHEMBL1824259
TypeSmall organic molecule
Emp. Form.C23H23NO
Mol. Mass.329.4348
SMILESCc1ccc(C)c(c1)-c1cccc(c1)C(=O)Nc1c(C)cccc1C