Reaction Details
TargetBeta-1 adrenergic receptor
LigandBDBM50352111
Substrate/Competitorn/a
Meas. Tech.ChEMBL_766718 (CHEMBL1827496)
Ki 2300±n/a nM
Citation Stephenson, KAWilson, AAHoule, SVasdev, N Synthesis and in vitro evaluation of derivatives of theß¿?-adrenergic receptor antagonist HX-CH 44. Bioorg Med Chem Lett21:5506-9 (2011) 
 
Beta-1 adrenergic receptor
Name:Beta-1 adrenergic receptor
Type:G Protein-Coupled Receptor (GPCR)
Mol. Mass.:51338.40
Organism:Homo sapiens (Human)
Description:P08588
Residue:477
BDBM50352111
NameBDBM50352111
Synonyms:CHEMBL1824265
TypeSmall organic molecule
Emp. Form.C22H26FN3O4
Mol. Mass.415.4579
SMILESCOc1ccc2nc(-c3ccc(OCC(O)CNC(C)CF)cc3)n(C)c(=O)c2c1