Reaction Details
TargetMu-type opioid receptor
LigandBDBM50352118
Substrate/Competitorn/a
Meas. Tech.ChEMBL_767030 (CHEMBL1828461)
Ki 0.450000±n/a nM
Citation Yuan, YElbegdorj, OChen, JAkubathini, SKBeletskaya, IOSelley, DEZhang, Y Structure selectivity relationship studies of 17-cyclopropylmethyl-3,14ß-dihydroxy-4,5a-epoxy-6ß-[(4'-pyridyl)carboxamido]morphinan derivatives toward the development of the mu opioid receptor antagonists. Bioorg Med Chem Lett21:5625-9 (2011) 
 
Mu-type opioid receptor
Name:Mu-type opioid receptor
Type:G Protein-Coupled Receptor (GPCR)
Mol. Mass.:44789.51
Organism:Homo sapiens (Human)
Description:P35372
Residue:400
BDBM50352118
NameBDBM50352118
Synonyms:CHEMBL1824513 | CHEMBL1852602
TypeSmall organic molecule
Emp. Form.C26H28BrN3O4
Mol. Mass.526.422
SMILESOc1ccc2C[C@H]3N(CC4CC4)CC[C@@]45[C@@H](Oc1c24)[C@@H](CC[C@@]35O)NC(=O)c1ccncc1Br