Reaction Details
TargetHistamine H1 receptor
LigandBDBM50352153
Substrate/Competitorn/a
Meas. Tech.ChEMBL_767137 (CHEMBL1826288)
Ki<10000±n/a nM
Citation Banister, SDYoo, DTChua, SWCui, JMach, RHKassiou, M N-Arylalkyl-2-azaadamantanes as cage-expanded polycarbocyclic sigma (s) receptor ligands. Bioorg Med Chem Lett21:5289-92 (2011) 
 
Histamine H1 receptor
Name:Histamine H1 receptor
Type:G Protein-Coupled Receptor (GPCR)
Mol. Mass.:55808.72
Organism:Homo sapiens (Human)
Description:Cell pellets from SK-N-MC cells transfected with human H1 receptor were used in binding assay.
Residue:487
BDBM50352153
NameBDBM50352153
Synonyms:CHEMBL1824784
TypeSmall organic molecule
Emp. Form.C16H21N
Mol. Mass.227.3446
SMILESC(N1C2CC3CC(C2)CC1C3)c1ccccc1