Reaction Details
TargetSigma non-opioid intracellular receptor 1
LigandBDBM50352154
Substrate/Competitorn/a
Meas. Tech.ChEMBL_767116 (CHEMBL1826165)
Ki 246±n/a nM
Citation Banister, SDYoo, DTChua, SWCui, JMach, RHKassiou, M N-Arylalkyl-2-azaadamantanes as cage-expanded polycarbocyclic sigma (s) receptor ligands. Bioorg Med Chem Lett21:5289-92 (2011) 
 
Sigma non-opioid intracellular receptor 1
Name:Sigma non-opioid intracellular receptor 1
Type:Protein
Mol. Mass.:25307.17
Organism:Cavia porcellus (Guinea pig)
Description:Q60492
Residue:223
BDBM50352154
NameBDBM50352154
Synonyms:CHEMBL1824783
TypeSmall organic molecule
Emp. Form.C17H22FNO
Mol. Mass.275.3611
SMILESOC12CC3CC(CC(C3)N1CCc1ccc(F)cc1)C2