Reaction Details
TargetMuscarinic acetylcholine receptor M5
LigandBDBM50352153
Substrate/Competitorn/a
Meas. Tech.ChEMBL_767227 (CHEMBL1826473)
Ki 6546±n/a nM
Citation Banister, SDYoo, DTChua, SWCui, JMach, RHKassiou, M N-Arylalkyl-2-azaadamantanes as cage-expanded polycarbocyclic sigma (s) receptor ligands. Bioorg Med Chem Lett21:5289-92 (2011) 
 
Muscarinic acetylcholine receptor M5
Name:Muscarinic acetylcholine receptor M5
Type:PROTEIN
Mol. Mass.:60102.35
Organism:Homo sapiens (Human)
Description:ChEMBL_1517990
Residue:532
BDBM50352153
NameBDBM50352153
Synonyms:CHEMBL1824784
TypeSmall organic molecule
Emp. Form.C16H21N
Mol. Mass.227.3446
SMILESC(N1C2CC3CC(C2)CC1C3)c1ccccc1