Reaction Details
TargetAurora kinase B
LigandBDBM50352329
Substrate/Competitorn/a
Meas. Tech.ChEMBL_766655 (CHEMBL1827221)
IC50 16±n/a nM
Citation Abraham, SHadd, MJTran, LVickers, TSindac, JMilanov, ZVHolladay, MWBhagwat, SSHua, HFord Pulido, JMCramer, MDGitnick, DJames, JDao, ABelli, BArmstrong, RCTreiber, DKLiu, G Novel series of pyrrolotriazine analogs as highly potent pan-Aurora kinase inhibitors. Bioorg Med Chem Lett21:5296-300 (2011) 
 
Aurora kinase B
Name:Aurora kinase B
Type:Protein
Mol. Mass.:39327.72
Organism:Homo sapiens (Human)
Description:Q96GD4
Residue:344
BDBM50352329
NameBDBM50352329
Synonyms:CHEMBL1822647
TypeSmall organic molecule
Emp. Form.C26H32N8O3S
Mol. Mass.536.649
SMILESCc1cc(Nc2nc(Sc3ccc(NC(=O)CN4C[C@H](O)[C@H](C4)OC(C)(C)C)cc3)nn3cccc23)n[nH]1