Reaction Details
TargetAurora kinase B
LigandBDBM50352317
Substrate/Competitorn/a
Meas. Tech.ChEMBL_766653 (CHEMBL1827219)
Kd 17±n/a nM
Citation Abraham, SHadd, MJTran, LVickers, TSindac, JMilanov, ZVHolladay, MWBhagwat, SSHua, HFord Pulido, JMCramer, MDGitnick, DJames, JDao, ABelli, BArmstrong, RCTreiber, DKLiu, G Novel series of pyrrolotriazine analogs as highly potent pan-Aurora kinase inhibitors. Bioorg Med Chem Lett21:5296-300 (2011) 
 
Aurora kinase B
Name:Aurora kinase B
Type:Protein
Mol. Mass.:39327.72
Organism:Homo sapiens (Human)
Description:Q96GD4
Residue:344
BDBM50352317
NameBDBM50352317
Synonyms:CHEMBL1822659
TypeSmall organic molecule
Emp. Form.C28H26F2N8O3S
Mol. Mass.592.62
SMILESCc1cc(Nc2nc(Sc3ccc(NC(=O)CN4C[C@H](O)[C@H](C4)Oc4ccc(F)cc4F)cc3)nn3cccc23)n[nH]1