Reaction Details
TargetAurora kinase B
LigandBDBM50352332
Substrate/Competitorn/a
Meas. Tech.ChEMBL_766653 (CHEMBL1827219)
Kd 39±n/a nM
Citation Abraham, SHadd, MJTran, LVickers, TSindac, JMilanov, ZVHolladay, MWBhagwat, SSHua, HFord Pulido, JMCramer, MDGitnick, DJames, JDao, ABelli, BArmstrong, RCTreiber, DKLiu, G Novel series of pyrrolotriazine analogs as highly potent pan-Aurora kinase inhibitors. Bioorg Med Chem Lett21:5296-300 (2011) 
 
Aurora kinase B
Name:Aurora kinase B
Type:Protein
Mol. Mass.:39327.72
Organism:Homo sapiens (Human)
Description:Q96GD4
Residue:344
BDBM50352332
NameBDBM50352332
Synonyms:CHEMBL1822644
TypeSmall organic molecule
Emp. Form.C27H34N8O2S2
Mol. Mass.566.741
SMILESCc1cc(Nc2nc(Sc3ccc(NC(=O)CN4C[C@@H](C[C@H]4CO)SC(C)(C)C)cc3)nn3cccc23)n[nH]1