Reaction Details
TargetAurora kinase C
LigandBDBM50352310
Substrate/Competitorn/a
Meas. Tech.ChEMBL_766654 (CHEMBL1827220)
Kd 2±n/a nM
Citation Abraham, SHadd, MJTran, LVickers, TSindac, JMilanov, ZVHolladay, MWBhagwat, SSHua, HFord Pulido, JMCramer, MDGitnick, DJames, JDao, ABelli, BArmstrong, RCTreiber, DKLiu, G Novel series of pyrrolotriazine analogs as highly potent pan-Aurora kinase inhibitors. Bioorg Med Chem Lett21:5296-300 (2011) 
 
Aurora kinase C
Name:Aurora kinase C
Type:Enzyme
Mol. Mass.:35602.43
Organism:Homo sapiens (Human)
Description:Amino acid residues 1-309 were expressed as His-tagged fusion protein using baculovirus expression system.
Residue:309
BDBM50352310
NameBDBM50352310
Synonyms:CHEMBL1822637
TypeSmall organic molecule
Emp. Form.C27H34N8O3S
Mol. Mass.550.676
SMILESCc1cc(Nc2nc(Sc3ccc(NC(=O)CN4C[C@@H](C[C@H]4CO)OC(C)(C)C)cc3)nn3cccc23)n[nH]1