Reaction Details
TargetAurora kinase C
LigandBDBM50352312
Substrate/Competitorn/a
Meas. Tech.ChEMBL_766654 (CHEMBL1827220)
Kd 5±n/a nM
Citation Abraham, SHadd, MJTran, LVickers, TSindac, JMilanov, ZVHolladay, MWBhagwat, SSHua, HFord Pulido, JMCramer, MDGitnick, DJames, JDao, ABelli, BArmstrong, RCTreiber, DKLiu, G Novel series of pyrrolotriazine analogs as highly potent pan-Aurora kinase inhibitors. Bioorg Med Chem Lett21:5296-300 (2011) 
 
Aurora kinase C
Name:Aurora kinase C
Type:Enzyme
Mol. Mass.:35602.43
Organism:Homo sapiens (Human)
Description:Amino acid residues 1-309 were expressed as His-tagged fusion protein using baculovirus expression system.
Residue:309
BDBM50352312
NameBDBM50352312
Synonyms:CHEMBL1822494
TypeSmall organic molecule
Emp. Form.C20H22N8OS
Mol. Mass.422.507
SMILESCN(C)CC(=O)Nc1ccc(Sc2nc(Nc3cc(C)[nH]n3)c3cccn3n2)cc1