Reaction Details
TargetHistamine H3 receptor
LigandBDBM50319509
Substrate/Competitorn/a
Meas. Tech.ChEMBL_766669 (CHEMBL1827363)
Ki 0.1±n/a nM
Citation Levoin, NLabeeuw, OCalmels, TPoupardin-Olivier, OBerrebi-Bertrand, ILecomte, JMSchwartz, JCCapet, M Novel and highly potent histamine H3 receptor ligands. Part 1: withdrawing of hERG activity. Bioorg Med Chem Lett21:5378-83 (2011) 
 
Histamine H3 receptor
Name:Histamine H3 receptor
Type:G Protein-Coupled Receptor (GPCR)
Mol. Mass.:48691.47
Organism:Homo sapiens (Human)
Description:Binding assays were using CHO cells stably expressing hH3R receptors.
Residue:445
BDBM50319509
NameBDBM50319509
Synonyms:(R)-6-(2-(2-methylpyrrolidin-1-yl)ethyl)-2-(pyridin-3-yl)quinoline | CHEMBL1084560
TypeSmall organic molecule
Emp. Form.C21H23N3
Mol. Mass.317.4274
SMILESC[C@@H]1CCCN1CCc1ccc2nc(ccc2c1)-c1cccnc1