Reaction Details
TargetPotassium voltage-gated channel subfamily H member 2
LigandBDBM50262887
Substrate/Competitorn/a
Meas. Tech.ChEMBL_766668 (CHEMBL1827362)
IC50 10000±n/a nM
Citation Levoin, NLabeeuw, OCalmels, TPoupardin-Olivier, OBerrebi-Bertrand, ILecomte, JMSchwartz, JCCapet, M Novel and highly potent histamine H3 receptor ligands. Part 1: withdrawing of hERG activity. Bioorg Med Chem Lett21:5378-83 (2011) 
 
Potassium voltage-gated channel subfamily H member 2
Name:Potassium voltage-gated channel subfamily H member 2
Type:Multi-pass membrane protein
Mol. Mass.:126672.65
Organism:Homo sapiens (Human)
Description:Q12809
Residue:1159
BDBM50262887
NameBDBM50262887
Synonyms:8-Fluoro-2-methyl-3-(4-{[3-(1-pyrrolidinyl)propyl]oxy}phenyl)-4(3H)-quinazolinone | CHEMBL515150
TypeSmall organic molecule
Emp. Form.C22H24FN3O2
Mol. Mass.381.4433
SMILESCc1nc2c(F)cccc2c(=O)n1-c1ccc(OCCCN2CCCC2)cc1