Reaction Details
TargetHistamine H3 receptor
LigandBDBM50319552
Substrate/Competitorn/a
Meas. Tech.ChEMBL_766669 (CHEMBL1827363)
Ki 0.1±n/a nM
Citation Levoin, NLabeeuw, OCalmels, TPoupardin-Olivier, OBerrebi-Bertrand, ILecomte, JMSchwartz, JCCapet, M Novel and highly potent histamine H3 receptor ligands. Part 1: withdrawing of hERG activity. Bioorg Med Chem Lett21:5378-83 (2011) 
 
Histamine H3 receptor
Name:Histamine H3 receptor
Type:G Protein-Coupled Receptor (GPCR)
Mol. Mass.:48691.47
Organism:Homo sapiens (Human)
Description:Binding assays were using CHO cells stably expressing hH3R receptors.
Residue:445
BDBM50319552
NameBDBM50319552
Synonyms:(R)-6-methyl-5-(6-(2-(2-methylpyrrolidin-1-yl)ethyl)quinolin-2-yl)thiazolo[3,2-b][1,2,4]triazole | CHEMBL1084383
TypeSmall organic molecule
Emp. Form.C21H23N5S
Mol. Mass.377.506
SMILESC[C@@H]1CCCN1CCc1ccc2nc(ccc2c1)-c1sc2ncnn2c1C