Reaction Details
TargetPotassium voltage-gated channel subfamily H member 2
LigandBDBM50246243
Substrate/Competitorn/a
Meas. Tech.ChEMBL_766668 (CHEMBL1827362)
IC50 1800±n/a nM
Citation Levoin, NLabeeuw, OCalmels, TPoupardin-Olivier, OBerrebi-Bertrand, ILecomte, JMSchwartz, JCCapet, M Novel and highly potent histamine H3 receptor ligands. Part 1: withdrawing of hERG activity. Bioorg Med Chem Lett21:5378-83 (2011) 
 
Potassium voltage-gated channel subfamily H member 2
Name:Potassium voltage-gated channel subfamily H member 2
Type:Multi-pass membrane protein
Mol. Mass.:126672.65
Organism:Homo sapiens (Human)
Description:Q12809
Residue:1159
BDBM50246243
NameBDBM50246243
Synonyms:2-(4-(3-(piperidin-1-yl)propoxy)phenyl)-3-propylquinazolin-4(3H)-one | CHEMBL487230
TypeSmall organic molecule
Emp. Form.C25H31N3O2
Mol. Mass.405.5325
SMILESCCCn1c(nc2ccccc2c1=O)-c1ccc(OCCCN2CCCCC2)cc1