Reaction Details
TargetTranscriptional regulator ERG
LigandBDBM50352296
Substrate/Competitorn/a
Meas. Tech.ChEBML_766760
IC50>30000±n/a nM
Citation Ontoria, JMBufi, LLTorrisi, CBresciani, AGiomini, CRowley, MSerafini, SBin, HHao, WSteinkühler, CJones, P Identification of a series of 4-[3-(quinolin-2-yl)-1,2,4-oxadiazol-5-yl]piperazinyl ureas as potent smoothened antagonist hedgehog pathway inhibitors. Bioorg Med Chem Lett21:5274-82 (2011) 
 
Transcriptional regulator ERG
Name:Transcriptional regulator ERG
Type:PROTEIN
Mol. Mass.:54615.84
Organism:Homo sapiens (Human)
Description:ChEMBL_1335569
Residue:486
BDBM50352296
NameBDBM50352296
Synonyms:CHEMBL1822468
TypeSmall organic molecule
Emp. Form.C22H24F2N6O2
Mol. Mass.442.4618
SMILESFC1(F)CCC(CC1)NC(=O)N1CCN(CC1)c1nc(no1)-c1ccc2ccccc2n1