Reaction Details
TargetSomatostatin receptor type 2
LigandBDBM81767
Substrate/Competitorn/a
Meas. Tech.ChEMBL_766829 (CHEMBL1827862)
IC50 0.67±n/a nM
Citation Erchegyi, JCescato, RWaser, BRivier, JEReubi, JC N-imidazolebenzyl-histidine substitution in somatostatin and in its octapeptide analogue modulates receptor selectivity and function. J Med Chem54:5981-7 (2011) 
 
Somatostatin receptor type 2
Name:Somatostatin receptor type 2
Type:Enzyme
Mol. Mass.:41344.94
Organism:Homo sapiens (Human)
Description:P30874
Residue:369
BDBM81767
NameBDBM81767
Synonyms:15-28-Somatostatin-28 CB6417646 | Somatostatin-14
TypeSmall organic molecule
Emp. Form.C76H104N18O19S2
Mol. Mass.1637.878
SMILESC[C@@H](O)[C@@H]1NC(=O)[C@H](Cc2ccccc2)NC(=O)[C@@H](NC(=O)[C@H](CCCCN)NC(=O)[C@H](Cc2c[nH]c3ccccc23)NC(=O)[C@H](Cc2ccccc2)NC(=O)[C@H](Cc2ccccc2)NC(=O)[C@H](CC(N)=O)NC(=O)[C@H](CCCCN)NC(=O)[C@H](CSSC[C@H](NC(=O)[C@H](CO)NC1=O)C(O)=O)NC(=O)CNC(=O)[C@H](C)N)[C@@H](C)O