Reaction Details
TargetCyclin-dependent kinase 5 activator 1
LigandBDBM50352494
Substrate/Competitorn/a
Meas. Tech.ChEMBL_767043 (CHEMBL1828474)
IC50 26400000±n/a nM
Citation Monte, FLKramer, TBoländer, APlotkin, BEldar-Finkelman, HFuertes, ADominguez, JSchmidt, B Synthesis and biological evaluation of glycogen synthase kinase 3 (GSK-3) inhibitors: an fast and atom efficient access to 1-aryl-3-benzylureas. Bioorg Med Chem Lett21:5610-5 (2011) 
 
Cyclin-dependent kinase 5 activator 1
Name:Cyclin-dependent kinase 5 activator 1
Type:Protein Complex
Mol. Mass.:n/a
Description:n/a
Components:This complex has 2 components.
Component 1
Name:Cyclin-dependent kinase 5
Synonyms:CDK5 CDKN5 Cyclin-dependent kinase 5 (CDK5/ p25) Cyclin-dependent-like kinase 5 PSSALRE Tau protein kinase II catalytic subunit
Type:Enzyme Subunit
Mol. Mass.:33308.61
Organism:Homo sapiens (Human)
Description:n/a
Residue:292
Component 2
Name:Cyclin-dependent kinase 5 activator 1
Synonyms:CD5R1_HUMAN CDK5R1 Cyclin-dependent kinase 5 (CDK5/p25) NCK5A p35
Type:Enzyme Subunit
Mol. Mass.:34077.43
Organism:Homo sapiens (Human)
Description:Q15078
Residue:307
BDBM50352494
NameBDBM50352494
Synonyms:CHEMBL1824332
TypeSmall organic molecule
Emp. Form.C17H15N7O2S
Mol. Mass.381.412
SMILESCOc1ccc(CNC(=O)Nc2nc3ccc(cc3s2)-c2nnn[nH]2)cc1