Reaction Details
TargetCasein kinase I isoform epsilon
LigandBDBM50352494
Substrate/Competitorn/a
Meas. Tech.ChEMBL_767044 (CHEMBL1828475)
IC50 15300000±n/a nM
Citation Monte, FLKramer, TBoländer, APlotkin, BEldar-Finkelman, HFuertes, ADominguez, JSchmidt, B Synthesis and biological evaluation of glycogen synthase kinase 3 (GSK-3) inhibitors: an fast and atom efficient access to 1-aryl-3-benzylureas. Bioorg Med Chem Lett21:5610-5 (2011) 
 
Casein kinase I isoform epsilon
Name:Casein kinase I isoform epsilon
Type:Protein
Mol. Mass.:47340.25
Organism:Homo sapiens (Human)
Description:P49674
Residue:416
BDBM50352494
NameBDBM50352494
Synonyms:CHEMBL1824332
TypeSmall organic molecule
Emp. Form.C17H15N7O2S
Mol. Mass.381.412
SMILESCOc1ccc(CNC(=O)Nc2nc3ccc(cc3s2)-c2nnn[nH]2)cc1