Reaction Details
TargetHepatocyte growth factor receptor
LigandBDBM50352555
Substrate/Competitorn/a
Meas. Tech.ChEMBL_767236 (CHEMBL1826482)
IC50 45±n/a nM
Citation Cui, JJTran-Dubé, MShen, HNambu, MKung, PPPairish, MJia, LMeng, JFunk, LBotrous, IMcTigue, MGrodsky, NRyan, KPadrique, EAlton, GTimofeevski, SYamazaki, SLi, QZou, HChristensen, JMroczkowski, BBender, SKania, RSEdwards, MP Structure based drug design of crizotinib (PF-02341066), a potent and selective dual inhibitor of mesenchymal-epithelial transition factor (c-MET) kinase and anaplastic lymphoma kinase (ALK). J Med Chem54:6342-63 (2011) 
 
Hepatocyte growth factor receptor
Name:Hepatocyte growth factor receptor
Type:Protein
Mol. Mass.:155559.73
Organism:Homo sapiens (Human)
Description:P08581
Residue:1390
BDBM50352555
NameBDBM50352555
Synonyms:CHEMBL1825132
TypeSmall organic molecule
Emp. Form.C20H20Cl2FN5O
Mol. Mass.436.31
SMILESCC(Oc1cc(cnc1N)-c1cnn(CC2CNC2)c1)c1c(Cl)ccc(F)c1Cl