Reaction Details
TargetHepatocyte growth factor receptor
LigandBDBM50242737
Substrate/Competitorn/a
Meas. Tech.ChEMBL_767237 (CHEMBL1826483)
IC50 9±n/a nM
Citation Cui, JJTran-Dubé, MShen, HNambu, MKung, PPPairish, MJia, LMeng, JFunk, LBotrous, IMcTigue, MGrodsky, NRyan, KPadrique, EAlton, GTimofeevski, SYamazaki, SLi, QZou, HChristensen, JMroczkowski, BBender, SKania, RSEdwards, MP Structure based drug design of crizotinib (PF-02341066), a potent and selective dual inhibitor of mesenchymal-epithelial transition factor (c-MET) kinase and anaplastic lymphoma kinase (ALK). J Med Chem54:6342-63 (2011) 
 
Hepatocyte growth factor receptor
Name:Hepatocyte growth factor receptor
Type:Protein
Mol. Mass.:155559.73
Organism:Homo sapiens (Human)
Description:P08581
Residue:1390
BDBM50242737
NameBDBM50242737
Synonyms:(R,Z)-5-(2,6-dichlorobenzylsulfonyl)-3-((3,5-dimethyl-4-(2-(pyrrolidin-1-ylmethyl)pyrrolidine-1-carbonyl)-1H-pyrrol-2-yl)methylene)indolin-2-one PHA-665752 | TCMDC-125885
TypeSmall organic molecule
Emp. Form.C32H34Cl2N4O4S
Mol. Mass.641.608
SMILESCc1[nH]c(\C=C2/C(=O)Nc3ccc(cc23)S(=O)(=O)Cc2c(Cl)cccc2Cl)c(C)c1C(=O)N1CCC[C@@H]1CN1CCCC1