Reaction Details
TargetPlatelet-derived growth factor receptor beta
LigandBDBM50306682
Substrate/Competitorn/a
Meas. Tech.ChEMBL_767361 (CHEMBL1825473)
IC50>10000±n/a nM
Citation Cui, JJTran-Dubé, MShen, HNambu, MKung, PPPairish, MJia, LMeng, JFunk, LBotrous, IMcTigue, MGrodsky, NRyan, KPadrique, EAlton, GTimofeevski, SYamazaki, SLi, QZou, HChristensen, JMroczkowski, BBender, SKania, RSEdwards, MP Structure based drug design of crizotinib (PF-02341066), a potent and selective dual inhibitor of mesenchymal-epithelial transition factor (c-MET) kinase and anaplastic lymphoma kinase (ALK). J Med Chem54:6342-63 (2011) 
 
Platelet-derived growth factor receptor beta
Name:Platelet-derived growth factor receptor beta
Type:Enzyme
Mol. Mass.:123922.25
Organism:Homo sapiens (Human)
Description:P09619
Residue:1106
BDBM50306682
NameBDBM50306682
Synonyms:(R)-3-(1-(2,6-dichloro-3-fluorophenyl)ethoxy)-5-(1-(piperidin-4-yl)-1H-pyrazol-4-yl)pyridin-2-amine 3-[(1R)-1-(2,6-dichloro-3-fluorophenyl)ethoxy]-5-(1-piperidin-4-yl-1H-pyrazol-4-yl)pyridin-2-amine CRIZOTINIB US10370379, Crizotinib US10780082, Compound Crizotinib US11517561, Compound Crizotinib US9199944, Crizotinib | US9226923, Crizotinib
TypeSmall organic molecule
Emp. Form.C21H22Cl2FN5O
Mol. Mass.450.337
SMILESC[C@@H](Oc1cc(cnc1N)-c1cnn(c1)C1CCNCC1)c1c(Cl)ccc(F)c1Cl