Reaction Details
TargetMitogen-activated protein kinase 10
LigandBDBM50352616
Substrate/Competitorn/a
Meas. Tech.ChEMBL_767484 (CHEMBL1825596)
IC50 9±n/a nM
Citation Bowers, STruong, APJeffrey Neitz, RHom, RKSealy, JMProbst, GDQuincy, DPeterson, BChan, WGalemmo, RAKonradi, AWSham, HLTóth, GPan, HLin, MYao, NArtis, DRZhang, HChen, LDryer, MSamant, BZmolek, WWong, KLorentzen, CGoldbach, ETonn, GQuinn, KPSauer, JMWright, SPowell, KRuslim, LRen, ZBard, FYednock, TAGriswold-Prenner, I Design and synthesis of brain penetrant selective JNK inhibitors with improved pharmacokinetic properties for the prevention of neurodegeneration. Bioorg Med Chem Lett21:5521-7 (2011) 
 
Mitogen-activated protein kinase 10
Name:Mitogen-activated protein kinase 10
Type:Enzyme
Mol. Mass.:52586.89
Organism:Homo sapiens (Human)
Description:n/a
Residue:464
BDBM50352616
NameBDBM50352616
Synonyms:CHEMBL1822147
TypeSmall organic molecule
Emp. Form.C18H11BrF3N5O2S
Mol. Mass.498.276
SMILESFC(F)(F)c1ccc2ccc(=O)n(CC(=O)Nc3scc(Br)c3-c3nnc[nH]3)c2c1