Reaction Details
TargetMitogen-activated protein kinase 8
LigandBDBM50352610
Substrate/Competitorn/a
Meas. Tech.ChEMBL_767486 (CHEMBL1825598)
IC50 4±n/a nM
Citation Bowers, STruong, APJeffrey Neitz, RHom, RKSealy, JMProbst, GDQuincy, DPeterson, BChan, WGalemmo, RAKonradi, AWSham, HLTóth, GPan, HLin, MYao, NArtis, DRZhang, HChen, LDryer, MSamant, BZmolek, WWong, KLorentzen, CGoldbach, ETonn, GQuinn, KPSauer, JMWright, SPowell, KRuslim, LRen, ZBard, FYednock, TAGriswold-Prenner, I Design and synthesis of brain penetrant selective JNK inhibitors with improved pharmacokinetic properties for the prevention of neurodegeneration. Bioorg Med Chem Lett21:5521-7 (2011) 
 
Mitogen-activated protein kinase 8
Name:Mitogen-activated protein kinase 8
Type:Enzyme
Mol. Mass.:48297.57
Organism:Homo sapiens (Human)
Description:JNK-1 was purchased from Upstate Cell Signaling Solutions (formerly Upstate Biotechnology).
Residue:427
BDBM50352610
NameBDBM50352610
Synonyms:CHEMBL1822141
TypeSmall organic molecule
Emp. Form.C17H10BrF3N6O2S
Mol. Mass.499.265
SMILESFC(F)(F)c1cc2n(CC(=O)Nc3scc(Br)c3-c3nnc[nH]3)c(=O)ccc2cn1