Reaction Details
TargetMitogen-activated protein kinase 8
LigandBDBM50352623
Substrate/Competitorn/a
Meas. Tech.ChEMBL_767486 (CHEMBL1825598)
IC50 13±n/a nM
Citation Bowers, STruong, APJeffrey Neitz, RHom, RKSealy, JMProbst, GDQuincy, DPeterson, BChan, WGalemmo, RAKonradi, AWSham, HLTóth, GPan, HLin, MYao, NArtis, DRZhang, HChen, LDryer, MSamant, BZmolek, WWong, KLorentzen, CGoldbach, ETonn, GQuinn, KPSauer, JMWright, SPowell, KRuslim, LRen, ZBard, FYednock, TAGriswold-Prenner, I Design and synthesis of brain penetrant selective JNK inhibitors with improved pharmacokinetic properties for the prevention of neurodegeneration. Bioorg Med Chem Lett21:5521-7 (2011) 
 
Mitogen-activated protein kinase 8
Name:Mitogen-activated protein kinase 8
Type:Enzyme
Mol. Mass.:48297.57
Organism:Homo sapiens (Human)
Description:JNK-1 was purchased from Upstate Cell Signaling Solutions (formerly Upstate Biotechnology).
Residue:427
BDBM50352623
NameBDBM50352623
Synonyms:CHEMBL1822154 | US9796706, Compound 150
TypeSmall organic molecule
Emp. Form.C17H13BrN4O2S2
Mol. Mass.449.345
SMILESBrc1csc(NC(=O)CN2C(=O)CCc3ncccc23)c1-c1nccs1