Reaction Details
TargetMitogen-activated protein kinase 14
LigandBDBM50352615
Substrate/Competitorn/a
Meas. Tech.ChEMBL_767570 (CHEMBL1825682)
IC50>50000±n/a nM
Citation Bowers, STruong, APJeffrey Neitz, RHom, RKSealy, JMProbst, GDQuincy, DPeterson, BChan, WGalemmo, RAKonradi, AWSham, HLTóth, GPan, HLin, MYao, NArtis, DRZhang, HChen, LDryer, MSamant, BZmolek, WWong, KLorentzen, CGoldbach, ETonn, GQuinn, KPSauer, JMWright, SPowell, KRuslim, LRen, ZBard, FYednock, TAGriswold-Prenner, I Design and synthesis of brain penetrant selective JNK inhibitors with improved pharmacokinetic properties for the prevention of neurodegeneration. Bioorg Med Chem Lett21:5521-7 (2011) 
 
Mitogen-activated protein kinase 14
Name:Mitogen-activated protein kinase 14
Type:Serine/threonine-protein kinase
Mol. Mass.:41286.76
Organism:Homo sapiens (Human)
Description:Q16539
Residue:360
BDBM50352615
NameBDBM50352615
Synonyms:CHEMBL1822146
TypeSmall organic molecule
Emp. Form.C18H11BrF3N5O2S
Mol. Mass.498.276
SMILESFC(F)(F)c1ccc2n(CC(=O)Nc3scc(Br)c3-c3nnc[nH]3)c(=O)ccc2c1