Reaction Details
TargetMitogen-activated protein kinase 8
LigandBDBM50352631
Substrate/Competitorn/a
Meas. Tech.ChEMBL_767684 (CHEMBL1825796)
IC50 0.7±n/a nM
Citation Stebbins, JLDe, SKPavlickova, PChen, VMachleidt, TChen, LHKuntzen, CKitada, SKarin, MPellecchia, M Design and characterization of a potent and selective dual ATP- and substrate-competitive subnanomolar bidentate c-Jun N-terminal kinase (JNK) inhibitor. J Med Chem54:6206-14 (2011) 
 
Mitogen-activated protein kinase 8
Name:Mitogen-activated protein kinase 8
Type:Enzyme
Mol. Mass.:48297.57
Organism:Homo sapiens (Human)
Description:JNK-1 was purchased from Upstate Cell Signaling Solutions (formerly Upstate Biotechnology).
Residue:427
BDBM50352631
NameBDBM50352631
Synonyms:CHEMBL1822313
TypeSmall organic molecule
Emp. Form.C50H74N16O12
Mol. Mass.1091.2226
SMILESCC(C)C[C@H](NC(=O)[C@@H](NC(=O)[C@@H](NC(=O)[C@@H]1CCCN1C(=O)[C@@H](N)CCCNC(N)=N)[C@@H](C)O)[C@@H](C)O)C(=O)N[C@@H](CC(N)=O)C(=O)NCC(=O)NCC(=O)NCCCNC(=O)c1ccc(cc1)-c1n[nH]c2ccccc12