Reaction Details
TargetMitogen-activated protein kinase 8
LigandBDBM50352629
Substrate/Competitorn/a
Meas. Tech.ChEMBL_766266 (CHEMBL1826508)
Ki 2±n/a nM
Citation Stebbins, JLDe, SKPavlickova, PChen, VMachleidt, TChen, LHKuntzen, CKitada, SKarin, MPellecchia, M Design and characterization of a potent and selective dual ATP- and substrate-competitive subnanomolar bidentate c-Jun N-terminal kinase (JNK) inhibitor. J Med Chem54:6206-14 (2011) 
 
Mitogen-activated protein kinase 8
Name:Mitogen-activated protein kinase 8
Type:Enzyme
Mol. Mass.:48297.57
Organism:Homo sapiens (Human)
Description:JNK-1 was purchased from Upstate Cell Signaling Solutions (formerly Upstate Biotechnology).
Residue:427
BDBM50352629
NameBDBM50352629
Synonyms:CHEMBL1822314
TypeSmall organic molecule
Emp. Form.C116H198N50O27
Mol. Mass.2725.1321
SMILESCC(C)C[C@@H](NC(=O)CNC(=O)CNC(=O)CCCNC(=O)c1ccc(cc1)-c1n[nH]c2ccccc12)C(=O)N[C@H](CC(N)=O)C(=O)N[C@H](CC(C)C)C(=O)N[C@H]([C@H](C)O)C(=O)N[C@H]([C@H](C)O)C(=O)N1CCC[C@@H]1C(=O)N[C@H](CCCN=C(N)N)C(=O)NCC(=O)NCC(=O)N[C@H](CCCN=C(N)N)C(=O)N[C@H](CCCN=C(N)N)C(=O)N[C@H](CCCN=C(N)N)C(=O)N[C@H](CCC(N)=O)C(=O)N[C@H](CCCN=C(N)N)C(=O)N[C@H](CCCN=C(N)N)C(=O)N[C@H](CCCCN)C(=O)N[C@H](CCCCN)C(=O)N[C@H](CCCN=C(N)N)C(=O)NCC(N)=O