Reaction Details
TargetLuciferin 4-monooxygenase
LigandBDBM50352634
Substrate/Competitorn/a
Meas. Tech.ChEMBL_766351 (CHEMBL1826377)
IC50 1600±n/a nM
Citation Xiao, JMarugan, JJZheng, WTitus, SSouthall, NCherry, JJEvans, MAndrophy, EJAustin, CP Discovery, synthesis, and biological evaluation of novel SMN protein modulators. J Med Chem54:6215-33 (2011) 
 
Luciferin 4-monooxygenase
Name:Luciferin 4-monooxygenase
Type:PROTEIN
Mol. Mass.:60126.66
Organism:Luciola lateralis
Description:ChEMBL_786225
Residue:548
BDBM50352634
NameBDBM50352634
Synonyms:CHEMBL1699500
TypeSmall organic molecule
Emp. Form.C15H15BrN2O2S
Mol. Mass.367.261
SMILESOC(=O)C1CCN(CC1)c1nc(cs1)-c1ccc(Br)cc1