Reaction Details
TargetLuciferin 4-monooxygenase
LigandBDBM50352637
Substrate/Competitorn/a
Meas. Tech.ChEMBL_766351 (CHEMBL1826377)
IC50 3200±n/a nM
Citation Xiao, JMarugan, JJZheng, WTitus, SSouthall, NCherry, JJEvans, MAndrophy, EJAustin, CP Discovery, synthesis, and biological evaluation of novel SMN protein modulators. J Med Chem54:6215-33 (2011) 
 
Luciferin 4-monooxygenase
Name:Luciferin 4-monooxygenase
Type:PROTEIN
Mol. Mass.:60126.66
Organism:Luciola lateralis
Description:ChEMBL_786225
Residue:548
BDBM50352637
NameBDBM50352637
Synonyms:CHEMBL1704063
TypeSmall organic molecule
Emp. Form.C17H20N4O3S
Mol. Mass.360.431
SMILESNC(=O)C1CCN(CC1)c1nnc(s1)-c1ccc2OCCCOc2c1