Reaction Details
TargetLuciferin 4-monooxygenase
LigandBDBM50352641
Substrate/Competitorn/a
Meas. Tech.ChEMBL_766351 (CHEMBL1826377)
IC50 5±n/a nM
Citation Xiao, JMarugan, JJZheng, WTitus, SSouthall, NCherry, JJEvans, MAndrophy, EJAustin, CP Discovery, synthesis, and biological evaluation of novel SMN protein modulators. J Med Chem54:6215-33 (2011) 
 
Luciferin 4-monooxygenase
Name:Luciferin 4-monooxygenase
Type:PROTEIN
Mol. Mass.:60126.66
Organism:Luciola lateralis
Description:ChEMBL_786225
Residue:548
BDBM50352641
NameBDBM50352641
Synonyms:CHEMBL1733803
TypeSmall organic molecule
Emp. Form.C18H20N2O4S
Mol. Mass.360.427
SMILESOC(=O)C1CCN(CC1)c1ncc(s1)-c1ccc2OCCCOc2c1