Reaction Details
TargetCarbonic anhydrase 4
LigandBDBM50352643
Substrate/Competitorn/a
Meas. Tech.ChEMBL_766481 (CHEMBL1826746)
pH7.5±n/a
Ki 7200±n/a nM
Commentsextracted
Citation Rami, MInnocenti, AMontero, JLScozzafava, AWinum, JYSupuran, CT Synthesis of rhodamine B-benzenesulfonamide conjugates and their inhibitory activity against humana- and bacterial/fungalß-carbonic anhydrases. Bioorg Med Chem Lett21:5210-3 (2011) 
 
Carbonic anhydrase 4
Name:Carbonic anhydrase 4
Type:Enzyme
Mol. Mass.:35037.98
Organism:Homo sapiens (Human)
Description:P22748
Residue:312
BDBM50352643
NameBDBM50352643
Synonyms:CHEMBL1822699
TypeSmall organic molecule
Emp. Form.C34H36N4O4S
Mol. Mass.596.739
SMILESCCN(CC)c1ccc2c(Oc3cc(ccc3C22N(C(=O)c3ccccc23)c2ccc(cc2)S(N)(=O)=O)N(CC)CC)c1