Reaction Details
TargetCarbonic anhydrase
LigandBDBM50352643
Substrate/Competitorn/a
Meas. Tech.ChEMBL_766490 (CHEMBL1826755)
pH8.3±n/a
Ki 4990±n/a nM
Commentsextracted
Citation Rami, MInnocenti, AMontero, JLScozzafava, AWinum, JYSupuran, CT Synthesis of rhodamine B-benzenesulfonamide conjugates and their inhibitory activity against humana- and bacterial/fungalß-carbonic anhydrases. Bioorg Med Chem Lett21:5210-3 (2011) 
 
Carbonic anhydrase
Name:Carbonic anhydrase
Type:Enzyme
Mol. Mass.:31587.59
Organism:Candida albicans (Yeast)
Description:n/a
Residue:281
BDBM50352643
NameBDBM50352643
Synonyms:CHEMBL1822699
TypeSmall organic molecule
Emp. Form.C34H36N4O4S
Mol. Mass.596.739
SMILESCCN(CC)c1ccc2c(Oc3cc(ccc3C22N(C(=O)c3ccccc23)c2ccc(cc2)S(N)(=O)=O)N(CC)CC)c1