Reaction Details
TargetCarbonic anhydrase 5B, mitochondrial
LigandBDBM50352644
Substrate/Competitorn/a
Meas. Tech.ChEMBL_766483 (CHEMBL1826748)
pH7.5±n/a
Ki 321±n/a nM
Commentsextracted
Citation Rami, MInnocenti, AMontero, JLScozzafava, AWinum, JYSupuran, CT Synthesis of rhodamine B-benzenesulfonamide conjugates and their inhibitory activity against humana- and bacterial/fungalß-carbonic anhydrases. Bioorg Med Chem Lett21:5210-3 (2011) 
 
Carbonic anhydrase 5B, mitochondrial
Name:Carbonic anhydrase 5B, mitochondrial
Type:Enzyme
Mol. Mass.:36440.83
Organism:Homo sapiens (Human)
Description:Human (cloned) isozyme
Residue:317
BDBM50352644
NameBDBM50352644
Synonyms:CHEMBL1822700
TypeSmall organic molecule
Emp. Form.C34H36N4O4S
Mol. Mass.596.739
SMILESCCN(CC)c1ccc2c(Oc3cc(ccc3C22N(C(=O)c3ccccc23)c2cccc(c2)S(N)(=O)=O)N(CC)CC)c1