Reaction Details
TargetCarbonic anhydrase
LigandBDBM50352645
Substrate/Competitorn/a
Meas. Tech.ChEMBL_766490 (CHEMBL1826755)
pH8.3±n/a
Ki 5320±n/a nM
Commentsextracted
Citation Rami, MInnocenti, AMontero, JLScozzafava, AWinum, JYSupuran, CT Synthesis of rhodamine B-benzenesulfonamide conjugates and their inhibitory activity against humana- and bacterial/fungalß-carbonic anhydrases. Bioorg Med Chem Lett21:5210-3 (2011) 
 
Carbonic anhydrase
Name:Carbonic anhydrase
Type:Enzyme
Mol. Mass.:31587.59
Organism:Candida albicans (Yeast)
Description:n/a
Residue:281
BDBM50352645
NameBDBM50352645
Synonyms:CHEMBL1822701
TypeSmall organic molecule
Emp. Form.C35H38N4O4S
Mol. Mass.610.766
SMILESCCN(CC)c1ccc2c(Oc3cc(ccc3C22N(Cc3ccc(cc3)S(N)(=O)=O)C(=O)c3ccccc23)N(CC)CC)c1