Reaction Details
TargetCarbonic anhydrase 2
LigandBDBM50352646
Substrate/Competitorn/a
Meas. Tech.ChEMBL_766479 (CHEMBL1826744)
pH7.5±n/a
Ki 955±n/a nM
Commentsextracted
Citation Rami, MInnocenti, AMontero, JLScozzafava, AWinum, JYSupuran, CT Synthesis of rhodamine B-benzenesulfonamide conjugates and their inhibitory activity against humana- and bacterial/fungalß-carbonic anhydrases. Bioorg Med Chem Lett21:5210-3 (2011) 
 
Carbonic anhydrase 2
Name:Carbonic anhydrase 2
Type:Enzyme
Mol. Mass.:29250.71
Organism:Homo sapiens (Human)
Description:P00918
Residue:260
BDBM50352646
NameBDBM50352646
Synonyms:CHEMBL1822702
TypeSmall organic molecule
Emp. Form.C36H40N4O4S
Mol. Mass.624.792
SMILESCCN(CC)c1ccc2c(Oc3cc(ccc3C22N(CCc3ccc(cc3)S(N)(=O)=O)C(=O)c3ccccc23)N(CC)CC)c1