Reaction Details
TargetCarbonic anhydrase 7
LigandBDBM50352646
Substrate/Competitorn/a
Meas. Tech.ChEMBL_766485 (CHEMBL1826750)
pH7.5±n/a
Ki 91.7±n/a nM
Commentsextracted
Citation Rami, MInnocenti, AMontero, JLScozzafava, AWinum, JYSupuran, CT Synthesis of rhodamine B-benzenesulfonamide conjugates and their inhibitory activity against humana- and bacterial/fungalß-carbonic anhydrases. Bioorg Med Chem Lett21:5210-3 (2011) 
 
Carbonic anhydrase 7
Name:Carbonic anhydrase 7
Type:Enzyme
Mol. Mass.:29664.11
Organism:Homo sapiens (Human)
Description:Human cloned isozyme.
Residue:264
BDBM50352646
NameBDBM50352646
Synonyms:CHEMBL1822702
TypeSmall organic molecule
Emp. Form.C36H40N4O4S
Mol. Mass.624.792
SMILESCCN(CC)c1ccc2c(Oc3cc(ccc3C22N(CCc3ccc(cc3)S(N)(=O)=O)C(=O)c3ccccc23)N(CC)CC)c1