Reaction Details
TargetCarbonic anhydrase 13
LigandBDBM10880
Substrate/Competitorn/a
Meas. Tech.ChEMBL_766491 (CHEMBL1826756)
pH7.5±n/a
Ki 17±n/a nM
Commentsextracted
Citation Rami, MInnocenti, AMontero, JLScozzafava, AWinum, JYSupuran, CT Synthesis of rhodamine B-benzenesulfonamide conjugates and their inhibitory activity against humana- and bacterial/fungalß-carbonic anhydrases. Bioorg Med Chem Lett21:5210-3 (2011) 
 
Carbonic anhydrase 13
Name:Carbonic anhydrase 13
Type:Enzyme
Mol. Mass.:29445.78
Organism:Homo sapiens (Human)
Description:Q8N1Q1
Residue:262
BDBM10880
NameBDBM10880
Synonyms:AZA AZM acetazolamide Acetazolamide Acetazolamide (AZA) Acetazolamide, 5 Acetazolamide, AZA CHEMBL20 Sulfonamide, 1 US11278534, Example acetazolamide sulfonamide 1
TypeSmall organic molecule
Emp. Form.C4H6N4O3S2
Mol. Mass.222.245
SMILESCC(=O)Nc1nnc(s1)S(N)(=O)=O