Reaction Details
TargetSodium-dependent serotonin transporter
LigandBDBM50130293
Substrate/Competitorn/a
Meas. Tech.ChEMBL_766791 (CHEMBL1827731)
Ki 98±n/a nM
Citation Seo, HJPark, EJKim, MJKang, SYLee, SHKim, HJLee, KNJung, MELee, MKim, MSSon, EJPark, WKKim, JLee, J Design and synthesis of novel arylpiperazine derivatives containing the imidazole core targeting 5-HT(2A) receptor and 5-HT transporter. J Med Chem54:6305-18 (2011) 
 
Sodium-dependent serotonin transporter
Name:Sodium-dependent serotonin transporter
Type:Multi-pass membrane protein
Mol. Mass.:70322.51
Organism:Homo sapiens (Human)
Description:P31645
Residue:630
BDBM50130293
NameBDBM50130293
Synonyms:7-{4-[4-(2,3-dichlorophenyl)piperazin-1-yl]butoxy}-3,4-dihydroquinolin-2(1H)-one CHEMBL1112 US10752588, Compound Aripiprazole US9018213, aripprazole | US9156822, Aripiprazole
TypeSmall organic molecule
Emp. Form.C23H27Cl2N3O2
Mol. Mass.448.385
SMILESClc1cccc(N2CCN(CCCCOc3ccc4CCC(=O)Nc4c3)CC2)c1Cl